{"text_format":"1","workbook":"xlsx","n_sheets":8,"sheets":["Cleanup","Interface","M Visual","M","S","p","Results","Analysis"],"not_rendered":{"charts":0,"images":0,"macros":1,"external_links":0,"defined_names":0,"comments":0,"pivot_tables":0},"unopened":[],"bounds":{"document_bytes":16777216,"sheet_cells":100000,"rows_first":2000,"rows_last":500,"rows_between":2000,"halvings":0,"cell_chars":16384,"cell_head_chars":4096},"cells_cut":0,"cells_raw":0,"read":"whole","date_system":"1900"}

{"sheet":"Cleanup","index":0,"n_rows":88,"n_cols":12,"rows_kept":88,"cut":false,"hidden":false,"merged":[[0,0,0,14]]}
["Use this sheet to format your information before copy-pasting it into the \"Interface\" sheet."]
[101,null,null,1,1739,4143,2022,5822,2136,4702,64,41]
[111,null,null,2,4191,2781,4241,1850,4292,4296,62,61]
[171,null,null,3,3110,1756,101,4096,4247,2725,91,42]
[291,null,null,4,3390,3135,3352,4676,2709,931,54,45]
[375,null,null,5,291,5350,3488,1625,2039,2338,72,121]
[379,null,null,6,111,375,2151,3061,4979,5934,94,64]
[931,null,null,7,4655,3695,171,1736,4645,2451,105,158]
[1625,null,null,8,5847,3067,2062,5125,1781,379,122,86]
[1736,null,null,9,4329,2704,3352,4787,6237,2022,81,47]
[1739,null,null,10,1756,4143,1625,375,3135,1739,112,65]
[1756,null,null,11,2709,1736,3695,1850,2338,5934,128,75]
[1781,null,null,12,5350,171,4191,3390,5125,3488,40,57]
[1850,null,null,13,2781,4979,931,3061,2062,4645,70,132]
[2022,null,null,14,111,101,4247,3067,4241,291,102,83]
[2039,null,null,15,2151,4702,4655,4329,3110,4296,47,42]
[2062,null,null,16,4096,2704,4676,4292,5822,5847,60,88]
[2136,null,null,17,6237,2136,2725,379,4787,2039,52,116]
[2151,null,null,18,2451,4143,3061,1781,4247,3390,137,49]
[2338,null,null,19,1739,2338,4296,4329,1756,931,87,114]
{"$rows_left_out":69}
{"sheet":"Interface","index":1,"n_rows":88,"n_cols":20,"rows_kept":88,"cut":false,"hidden":false,"merged":[[2,0,18,0],[12,2,22,3],[17,14,18,18],[19,14,20,18],[1,14,2,14],[4,14,5,14],[7,14,8,14],[10,14,11,14],[2,2,3,3],[4,2,6,3],[10,2,11,3]]}
["# Teams:",{"$f":"COUNTIF(B2:B101,\">0\")","v":52},null,"Match Schedule:","Match#","Red1","Red2","Red3","Blue1","Blue2","Blue3","Redscore","BlueScore"]
["Teams:",101,null,null,1,1739,4143,2022,5822,2136,4702,64,41,null,3]
["QUICK N' DIRTY OPR CALCULATOR                           Designed By Evan Grove",111,"STEP 1",null,2,4191,2781,4241,1850,4292,4296,62,61,null,null,null,null,null,null,"this should happen almost instantly."]
[null,171,null,null,3,3110,1756,101,4096,4247,2725,91,42]
[null,291,"fill in the team numbers in the orange column.",null,4,3390,3135,3352,4676,2709,931,54,45,null,4]
[null,375,null,null,5,291,5350,3488,1625,2039,2338,72,121,null,null,null,null,null,null,"this one will take a while."]
[null,379,null,null,6,111,375,2151,3061,4979,5934,94,64]
[null,931,null,null,7,4655,3695,171,1736,4645,2451,105,158,null,5]
[null,1625,null,null,8,5847,3067,2062,5125,1781,379,122,86,null,null,null,null,null,null,"should be a second or two."]
[null,1736,null,null,9,4329,2704,3352,4787,6237,2022,81,47]
[null,1739,"STEP 2",null,10,1756,4143,1625,375,3135,1739,112,65,null,6]
[null,1756,null,null,11,2709,1736,3695,1850,2338,5934,128,75,null,null,null,null,null,null,"this should be 1-6 seconds."]
[null,1781,"fill in the match schedule and scores. PROTIP: the columns here are set up the same way TBA shows it. Copy-paste from TBA into the \"cleanup\" sheet, delete the excess columns, and then move it here.",null,12,5350,171,4191,3390,5125,3488,40,57]
[null,1850,null,null,13,2781,4979,931,3061,2062,4645,70,132]
[null,2022,null,null,14,111,101,4247,3067,4241,291,102,83]
[null,2039,null,null,15,2151,4702,4655,4329,3110,4296,47,42]
[null,2062,null,null,16,4096,2704,4676,4292,5822,5847,60,88]
[null,2136,null,null,17,6237,2136,2725,379,4787,2039,52,116,null,"STEPS 3-6"]
[null,2151,null,null,18,2451,4143,3061,1781,4247,3390,137,49]
[null,2338,null,null,19,1739,2338,4296,4329,1756,931,87,114,null,"Click the buttons up there in order."]
{"$rows_left_out":69}
{"sheet":"M Visual","index":2,"n_rows":101,"n_cols":101,"rows_kept":101,"cut":false,"hidden":false,"merged":[]}
[null,101,111,171,291,375,379,931,1625,1736,1739,1756,1781,1850,2022,2039,2062,2136,2151,2338,2451,2704,2709,2725,2781,3061,3067,3110,3135,3352,3390,3488,3695,4096,4143,4191,4241,4247,4292,4296,4329,4645,4655,4676,4702,4787,4979,5125,5350,5822,5847,5934,6237]
[101,10,1,1,0,0,0,1,1,0,1,1,0,0,0,1,1,0,1,0,0,0,0,0,0,1,0,1,1,0,1,0,0,1,1,0,0,1,0,0,1,0,0,0,0,0,0,0,1,0,1,0,1,0,0,0,0,0,0,0,0,0,0,0,0,0,0,0,0,0,0,0,0,0,0,0,0,0,0,0,0,0,0,0,0,0,0,0,0,0,0,0,0,0,0,0,0,0,0,0,0]
[111,1,10,0,0,1,1,0,1,0,0,0,0,1,1,1,0,0,1,0,1,1,1,0,1,0,0,0,0,0,0,1,0,1,0,0,0,1,0,1,1,0,0,0,0,0,0,0,0,1,1,0,1,0,0,0,0,0,0,0,0,0,0,0,0,0,0,0,0,0,0,0,0,0,0,0,0,0,0,0,0,0,0,0,0,0,0,0,0,0,0,0,0,0,0,0,0,0,0,0,0]
[171,1,0,10,0,0,0,0,0,0,0,1,1,1,1,1,1,1,1,0,0,0,0,1,0,0,0,0,0,0,0,0,1,0,0,1,1,1,1,0,0,0,1,1,0,0,0,1,1,0,0,0,1,0,0,0,0,0,0,0,0,0,0,0,0,0,0,0,0,0,0,0,0,0,0,0,0,0,0,0,0,0,0,0,0,0,0,0,0,0,0,0,0,0,0,0,0,0,0,0,0]
[291,0,0,0,10,0,0,0,0,1,1,0,0,1,0,0,0,1,0,1,0,0,0,0,1,0,1,1,1,0,0,1,0,1,0,0,1,1,1,1,1,0,1,0,0,1,0,0,1,0,0,1,0,0,0,0,0,0,0,0,0,0,0,0,0,0,0,0,0,0,0,0,0,0,0,0,0,0,0,0,0,0,0,0,0,0,0,0,0,0,0,0,0,0,0,0,0,0,0,0,0]
[375,0,1,0,0,10,0,0,0,0,1,1,0,0,1,0,1,1,1,0,0,0,0,1,1,1,1,1,1,0,0,0,1,0,0,0,1,1,0,1,0,1,0,0,1,0,0,1,0,0,0,0,0,0,0,0,0,0,0,0,0,0,0,0,0,0,0,0,0,0,0,0,0,0,0,0,0,0,0,0,0,0,0,0,0,0,0,0,0,0,0,0,0,0,0,0,0,0,0,0,0]
[379,0,1,0,0,0,10,0,1,0,0,0,1,0,0,1,0,1,0,0,1,0,1,1,1,0,1,0,0,0,0,0,0,1,0,0,0,0,0,1,1,0,0,1,1,1,1,1,1,0,0,0,1,0,0,0,0,0,0,0,0,0,0,0,0,0,0,0,0,0,0,0,0,0,0,0,0,0,0,0,0,0,0,0,0,0,0,0,0,0,0,0,0,0,0,0,0,0,0,0,0]
[931,1,0,0,0,0,0,10,0,0,1,1,0,1,0,0,0,0,1,0,1,0,1,0,1,0,0,0,1,1,1,0,0,0,1,0,0,1,0,0,1,0,1,1,0,1,1,0,0,0,1,1,0,0,0,0,0,0,0,0,0,0,0,0,0,0,0,0,0,0,0,0,0,0,0,0,0,0,0,0,0,0,0,0,0,0,0,0,0,0,0,0,0,0,0,0,0,0,0,0,0]
[1625,1,1,0,0,0,1,0,10,0,0,1,0,0,0,1,0,0,0,1,1,0,1,0,1,1,0,1,0,0,0,0,1,0,1,0,0,0,1,1,1,0,0,1,1,1,0,0,0,0,0,1,0,0,0,0,0,0,0,0,0,0,0,0,0,0,0,0,0,0,0,0,0,0,0,0,0,0,0,0,0,0,0,0,0,0,0,0,0,0,0,0,0,0,0,0,0,0,0,0,0]
[1736,0,0,0,1,0,0,0,0,10,1,0,1,0,1,0,0,0,0,0,1,1,1,0,0,1,0,0,1,1,0,1,1,0,1,0,0,0,0,1,1,1,0,1,0,0,0,0,0,1,1,0,1,0,0,0,0,0,0,0,0,0,0,0,0,0,0,0,0,0,0,0,0,0,0,0,0,0,0,0,0,0,0,0,0,0,0,0,0,0,0,0,0,0,0,0,0,0,0,0,0]
[1739,1,0,0,1,1,0,1,0,1,11,1,1,1,1,1,0,0,0,1,1,0,1,1,0,0,0,0,1,0,0,0,1,0,1,0,1,0,0,1,0,0,1,0,0,1,0,0,1,0,0,0,0,0,0,0,0,0,0,0,0,0,0,0,0,0,0,0,0,0,0,0,0,0,0,0,0,0,0,0,0,0,0,0,0,0,0,0,0,0,0,0,0,0,0,0,0,0,0,0,0]
[1756,1,0,1,0,1,0,1,1,0,1,10,1,0,0,0,0,1,1,0,0,0,1,1,0,1,0,1,0,1,0,0,1,0,1,0,0,0,0,0,1,0,0,0,1,0,1,0,1,0,0,0,0,0,0,0,0,0,0,0,0,0,0,0,0,0,0,0,0,0,0,0,0,0,0,0,0,0,0,0,0,0,0,0,0,0,0,0,0,0,0,0,0,0,0,0,0,0,0,0,0]
[1781,0,0,1,0,0,1,0,0,1,1,1,10,1,0,0,1,0,1,0,0,1,0,0,0,0,0,0,0,1,1,1,0,0,0,0,0,1,0,0,0,1,0,0,0,1,1,1,1,0,1,0,1,0,0,0,0,0,0,0,0,0,0,0,0,0,0,0,0,0,0,0,0,0,0,0,0,0,0,0,0,0,0,0,0,0,0,0,0,0,0,0,0,0,0,0,0,0,0,0,0]
[1850,0,1,1,1,0,0,1,0,0,1,0,1,10,1,1,0,0,0,1,0,1,0,0,0,0,0,1,0,0,0,0,0,0,0,0,0,0,1,1,1,0,1,0,0,1,0,0,1,1,0,1,1,0,0,0,0,0,0,0,0,0,0,0,0,0,0,0,0,0,0,0,0,0,0,0,0,0,0,0,0,0,0,0,0,0,0,0,0,0,0,0,0,0,0,0,0,0,0,0,0]
[2022,0,1,1,0,1,0,0,0,1,1,0,0,1,10,1,1,0,0,0,0,0,0,1,1,0,0,0,0,1,1,0,0,1,1,0,1,0,1,0,0,0,1,0,0,1,0,0,1,0,0,0,1,0,0,0,0,0,0,0,0,0,0,0,0,0,0,0,0,0,0,0,0,0,0,0,0,0,0,0,0,0,0,0,0,0,0,0,0,0,0,0,0,0,0,0,0,0,0,0,0]
[2039,1,1,1,0,0,1,0,1,0,1,0,0,1,1,10,1,0,0,1,1,0,0,0,0,0,0,1,0,0,0,0,0,1,0,0,1,1,1,0,0,1,0,0,0,1,0,1,0,0,0,1,0,0,0,0,0,0,0,0,0,0,0,0,0,0,0,0,0,0,0,0,0,0,0,0,0,0,0,0,0,0,0,0,0,0,0,0,0,0,0,0,0,0,0,0,0,0,0,0,0]
[2062,1,0,1,0,1,0,0,0,0,0,0,1,0,1,1,10,0,1,1,0,0,1,0,0,1,1,0,0,1,1,1,0,0,0,1,0,0,0,0,0,1,0,1,0,0,1,0,0,0,1,1,0,0,0,0,0,0,0,0,0,0,0,0,0,0,0,0,0,0,0,0,0,0,0,0,0,0,0,0,0,0,0,0,0,0,0,0,0,0,0,0,0,0,0,0,0,0,0,0,0]
[2136,0,0,1,1,1,1,0,0,0,0,1,0,0,0,0,0,10,0,0,1,0,0,1,0,0,1,0,1,1,0,0,1,0,1,0,0,1,0,0,0,1,0,1,1,0,0,1,0,1,0,1,1,0,0,0,0,0,0,0,0,0,0,0,0,0,0,0,0,0,0,0,0,0,0,0,0,0,0,0,0,0,0,0,0,0,0,0,0,0,0,0,0,0,0,0,0,0,0,0,0]
[2151,1,1,1,0,1,0,1,0,0,0,1,1,0,0,0,1,0,10,1,0,0,0,0,0,1,0,0,0,1,1,1,0,0,0,1,0,0,0,0,1,0,1,0,1,0,0,0,0,1,0,1,1,0,0,0,0,0,0,0,0,0,0,0,0,0,0,0,0,0,0,0,0,0,0,0,0,0,0,0,0,0,0,0,0,0,0,0,0,0,0,0,0,0,0,0,0,0,0,0,0]
[2338,0,0,0,1,0,0,0,1,0,1,0,0,1,0,1,1,0,1,10,0,0,0,1,1,1,0,0,1,0,0,1,0,1,0,1,0,1,1,1,1,1,0,0,0,0,0,0,0,0,0,1,0,0,0,0,0,0,0,0,0,0,0,0,0,0,0,0,0,0,0,0,0,0,0,0,0,0,0,0,0,0,0,0,0,0,0,0,0,0,0,0,0,0,0,0,0,0,0,0,0]
{"$rows_left_out":82}
{"sheet":"M","index":3,"n_rows":100,"n_cols":100,"rows_kept":100,"cut":false,"hidden":false,"merged":[]}
[10,1,1,0,0,0,1,1,0,1,1,0,0,0,1,1,0,1,0,0,0,0,0,0,1,0,1,1,0,1,0,0,1,1,0,0,1,0,0,1,0,0,0,0,0,0,0,1,0,1,0,1,0,0,0,0,0,0,0,0,0,0,0,0,0,0,0,0,0,0,0,0,0,0,0,0,0,0,0,0,0,0,0,0,0,0,0,0,0,0,0,0,0,0,0,0,0,0,0,0]
[1,10,0,0,1,1,0,1,0,0,0,0,1,1,1,0,0,1,0,1,1,1,0,1,0,0,0,0,0,0,1,0,1,0,0,0,1,0,1,1,0,0,0,0,0,0,0,0,1,1,0,1,0,0,0,0,0,0,0,0,0,0,0,0,0,0,0,0,0,0,0,0,0,0,0,0,0,0,0,0,0,0,0,0,0,0,0,0,0,0,0,0,0,0,0,0,0,0,0,0]
[1,0,10,0,0,0,0,0,0,0,1,1,1,1,1,1,1,1,0,0,0,0,1,0,0,0,0,0,0,0,0,1,0,0,1,1,1,1,0,0,0,1,1,0,0,0,1,1,0,0,0,1,0,0,0,0,0,0,0,0,0,0,0,0,0,0,0,0,0,0,0,0,0,0,0,0,0,0,0,0,0,0,0,0,0,0,0,0,0,0,0,0,0,0,0,0,0,0,0,0]
[0,0,0,10,0,0,0,0,1,1,0,0,1,0,0,0,1,0,1,0,0,0,0,1,0,1,1,1,0,0,1,0,1,0,0,1,1,1,1,1,0,1,0,0,1,0,0,1,0,0,1,0,0,0,0,0,0,0,0,0,0,0,0,0,0,0,0,0,0,0,0,0,0,0,0,0,0,0,0,0,0,0,0,0,0,0,0,0,0,0,0,0,0,0,0,0,0,0,0,0]
[0,1,0,0,10,0,0,0,0,1,1,0,0,1,0,1,1,1,0,0,0,0,1,1,1,1,1,1,0,0,0,1,0,0,0,1,1,0,1,0,1,0,0,1,0,0,1,0,0,0,0,0,0,0,0,0,0,0,0,0,0,0,0,0,0,0,0,0,0,0,0,0,0,0,0,0,0,0,0,0,0,0,0,0,0,0,0,0,0,0,0,0,0,0,0,0,0,0,0,0]
[0,1,0,0,0,10,0,1,0,0,0,1,0,0,1,0,1,0,0,1,0,1,1,1,0,1,0,0,0,0,0,0,1,0,0,0,0,0,1,1,0,0,1,1,1,1,1,1,0,0,0,1,0,0,0,0,0,0,0,0,0,0,0,0,0,0,0,0,0,0,0,0,0,0,0,0,0,0,0,0,0,0,0,0,0,0,0,0,0,0,0,0,0,0,0,0,0,0,0,0]
[1,0,0,0,0,0,10,0,0,1,1,0,1,0,0,0,0,1,0,1,0,1,0,1,0,0,0,1,1,1,0,0,0,1,0,0,1,0,0,1,0,1,1,0,1,1,0,0,0,1,1,0,0,0,0,0,0,0,0,0,0,0,0,0,0,0,0,0,0,0,0,0,0,0,0,0,0,0,0,0,0,0,0,0,0,0,0,0,0,0,0,0,0,0,0,0,0,0,0,0]
[1,1,0,0,0,1,0,10,0,0,1,0,0,0,1,0,0,0,1,1,0,1,0,1,1,0,1,0,0,0,0,1,0,1,0,0,0,1,1,1,0,0,1,1,1,0,0,0,0,0,1,0,0,0,0,0,0,0,0,0,0,0,0,0,0,0,0,0,0,0,0,0,0,0,0,0,0,0,0,0,0,0,0,0,0,0,0,0,0,0,0,0,0,0,0,0,0,0,0,0]
[0,0,0,1,0,0,0,0,10,1,0,1,0,1,0,0,0,0,0,1,1,1,0,0,1,0,0,1,1,0,1,1,0,1,0,0,0,0,1,1,1,0,1,0,0,0,0,0,1,1,0,1,0,0,0,0,0,0,0,0,0,0,0,0,0,0,0,0,0,0,0,0,0,0,0,0,0,0,0,0,0,0,0,0,0,0,0,0,0,0,0,0,0,0,0,0,0,0,0,0]
[1,0,0,1,1,0,1,0,1,11,1,1,1,1,1,0,0,0,1,1,0,1,1,0,0,0,0,1,0,0,0,1,0,1,0,1,0,0,1,0,0,1,0,0,1,0,0,1,0,0,0,0,0,0,0,0,0,0,0,0,0,0,0,0,0,0,0,0,0,0,0,0,0,0,0,0,0,0,0,0,0,0,0,0,0,0,0,0,0,0,0,0,0,0,0,0,0,0,0,0]
[1,0,1,0,1,0,1,1,0,1,10,1,0,0,0,0,1,1,0,0,0,1,1,0,1,0,1,0,1,0,0,1,0,1,0,0,0,0,0,1,0,0,0,1,0,1,0,1,0,0,0,0,0,0,0,0,0,0,0,0,0,0,0,0,0,0,0,0,0,0,0,0,0,0,0,0,0,0,0,0,0,0,0,0,0,0,0,0,0,0,0,0,0,0,0,0,0,0,0,0]
[0,0,1,0,0,1,0,0,1,1,1,10,1,0,0,1,0,1,0,0,1,0,0,0,0,0,0,0,1,1,1,0,0,0,0,0,1,0,0,0,1,0,0,0,1,1,1,1,0,1,0,1,0,0,0,0,0,0,0,0,0,0,0,0,0,0,0,0,0,0,0,0,0,0,0,0,0,0,0,0,0,0,0,0,0,0,0,0,0,0,0,0,0,0,0,0,0,0,0,0]
[0,1,1,1,0,0,1,0,0,1,0,1,10,1,1,0,0,0,1,0,1,0,0,0,0,0,1,0,0,0,0,0,0,0,0,0,0,1,1,1,0,1,0,0,1,0,0,1,1,0,1,1,0,0,0,0,0,0,0,0,0,0,0,0,0,0,0,0,0,0,0,0,0,0,0,0,0,0,0,0,0,0,0,0,0,0,0,0,0,0,0,0,0,0,0,0,0,0,0,0]
[0,1,1,0,1,0,0,0,1,1,0,0,1,10,1,1,0,0,0,0,0,0,1,1,0,0,0,0,1,1,0,0,1,1,0,1,0,1,0,0,0,1,0,0,1,0,0,1,0,0,0,1,0,0,0,0,0,0,0,0,0,0,0,0,0,0,0,0,0,0,0,0,0,0,0,0,0,0,0,0,0,0,0,0,0,0,0,0,0,0,0,0,0,0,0,0,0,0,0,0]
[1,1,1,0,0,1,0,1,0,1,0,0,1,1,10,1,0,0,1,1,0,0,0,0,0,0,1,0,0,0,0,0,1,0,0,1,1,1,0,0,1,0,0,0,1,0,1,0,0,0,1,0,0,0,0,0,0,0,0,0,0,0,0,0,0,0,0,0,0,0,0,0,0,0,0,0,0,0,0,0,0,0,0,0,0,0,0,0,0,0,0,0,0,0,0,0,0,0,0,0]
[1,0,1,0,1,0,0,0,0,0,0,1,0,1,1,10,0,1,1,0,0,1,0,0,1,1,0,0,1,1,1,0,0,0,1,0,0,0,0,0,1,0,1,0,0,1,0,0,0,1,1,0,0,0,0,0,0,0,0,0,0,0,0,0,0,0,0,0,0,0,0,0,0,0,0,0,0,0,0,0,0,0,0,0,0,0,0,0,0,0,0,0,0,0,0,0,0,0,0,0]
[0,0,1,1,1,1,0,0,0,0,1,0,0,0,0,0,10,0,0,1,0,0,1,0,0,1,0,1,1,0,0,1,0,1,0,0,1,0,0,0,1,0,1,1,0,0,1,0,1,0,1,1,0,0,0,0,0,0,0,0,0,0,0,0,0,0,0,0,0,0,0,0,0,0,0,0,0,0,0,0,0,0,0,0,0,0,0,0,0,0,0,0,0,0,0,0,0,0,0,0]
[1,1,1,0,1,0,1,0,0,0,1,1,0,0,0,1,0,10,1,0,0,0,0,0,1,0,0,0,1,1,1,0,0,0,1,0,0,0,0,1,0,1,0,1,0,0,0,0,1,0,1,1,0,0,0,0,0,0,0,0,0,0,0,0,0,0,0,0,0,0,0,0,0,0,0,0,0,0,0,0,0,0,0,0,0,0,0,0,0,0,0,0,0,0,0,0,0,0,0,0]
[0,0,0,1,0,0,0,1,0,1,0,0,1,0,1,1,0,1,10,0,0,0,1,1,1,0,0,1,0,0,1,0,1,0,1,0,1,1,1,1,1,0,0,0,0,0,0,0,0,0,1,0,0,0,0,0,0,0,0,0,0,0,0,0,0,0,0,0,0,0,0,0,0,0,0,0,0,0,0,0,0,0,0,0,0,0,0,0,0,0,0,0,0,0,0,0,0,0,0,0]
[0,1,0,0,0,1,1,1,1,1,0,0,0,0,1,0,1,0,0,10,0,0,1,0,1,0,0,0,0,1,1,0,0,1,1,0,1,1,0,0,1,0,0,0,0,1,1,0,0,0,1,0,0,0,0,0,0,0,0,0,0,0,0,0,0,0,0,0,0,0,0,0,0,0,0,0,0,0,0,0,0,0,0,0,0,0,0,0,0,0,0,0,0,0,0,0,0,0,0,0]
{"$rows_left_out":81}
{"sheet":"S","index":4,"n_rows":101,"n_cols":1,"rows_kept":101,"cut":false,"hidden":false,"merged":[]}
[{"$f":"SUMIF(Interface!$F$2:$F$101,\"=\"&Interface!B2,Interface!$L$2:$L$101)+SUMIF(Interface!$G$2:$G$101,\"=\"&Interface!B2,Interface!$L$2:$L$101)+SUMIF(Interface!$H$2:$H$101,\"=\"&Interface!B2,Interface!$L$2:$L$101)+SUMIF(Interface!$I$2:$I$101,\"=\"&Interface!B2,Interface!$M$2:$M$101)+SUMIF(Interface!$J$2:$J$101,\"=\"&Interface!B2,Interface!$M$2:$M$101)+SUMIF(Interface!$K$2:$K$101,\"=\"&Interface!B2,Interface!$M$2:$M$101)","v":881}]
[{"$f":"SUMIF(Interface!$F$2:$F$101,\"=\"&Interface!B3,Interface!$L$2:$L$101)+SUMIF(Interface!$G$2:$G$101,\"=\"&Interface!B3,Interface!$L$2:$L$101)+SUMIF(Interface!$H$2:$H$101,\"=\"&Interface!B3,Interface!$L$2:$L$101)+SUMIF(Interface!$I$2:$I$101,\"=\"&Interface!B3,Interface!$M$2:$M$101)+SUMIF(Interface!$J$2:$J$101,\"=\"&Interface!B3,Interface!$M$2:$M$101)+SUMIF(Interface!$K$2:$K$101,\"=\"&Interface!B3,Interface!$M$2:$M$101)","v":1129}]
[{"$f":"SUMIF(Interface!$F$2:$F$101,\"=\"&Interface!B4,Interface!$L$2:$L$101)+SUMIF(Interface!$G$2:$G$101,\"=\"&Interface!B4,Interface!$L$2:$L$101)+SUMIF(Interface!$H$2:$H$101,\"=\"&Interface!B4,Interface!$L$2:$L$101)+SUMIF(Interface!$I$2:$I$101,\"=\"&Interface!B4,Interface!$M$2:$M$101)+SUMIF(Interface!$J$2:$J$101,\"=\"&Interface!B4,Interface!$M$2:$M$101)+SUMIF(Interface!$K$2:$K$101,\"=\"&Interface!B4,Interface!$M$2:$M$101)","v":792}]
[{"$f":"SUMIF(Interface!$F$2:$F$101,\"=\"&Interface!B5,Interface!$L$2:$L$101)+SUMIF(Interface!$G$2:$G$101,\"=\"&Interface!B5,Interface!$L$2:$L$101)+SUMIF(Interface!$H$2:$H$101,\"=\"&Interface!B5,Interface!$L$2:$L$101)+SUMIF(Interface!$I$2:$I$101,\"=\"&Interface!B5,Interface!$M$2:$M$101)+SUMIF(Interface!$J$2:$J$101,\"=\"&Interface!B5,Interface!$M$2:$M$101)+SUMIF(Interface!$K$2:$K$101,\"=\"&Interface!B5,Interface!$M$2:$M$101)","v":767}]
[{"$f":"SUMIF(Interface!$F$2:$F$101,\"=\"&Interface!B6,Interface!$L$2:$L$101)+SUMIF(Interface!$G$2:$G$101,\"=\"&Interface!B6,Interface!$L$2:$L$101)+SUMIF(Interface!$H$2:$H$101,\"=\"&Interface!B6,Interface!$L$2:$L$101)+SUMIF(Interface!$I$2:$I$101,\"=\"&Interface!B6,Interface!$M$2:$M$101)+SUMIF(Interface!$J$2:$J$101,\"=\"&Interface!B6,Interface!$M$2:$M$101)+SUMIF(Interface!$K$2:$K$101,\"=\"&Interface!B6,Interface!$M$2:$M$101)","v":766}]
[{"$f":"SUMIF(Interface!$F$2:$F$101,\"=\"&Interface!B7,Interface!$L$2:$L$101)+SUMIF(Interface!$G$2:$G$101,\"=\"&Interface!B7,Interface!$L$2:$L$101)+SUMIF(Interface!$H$2:$H$101,\"=\"&Interface!B7,Interface!$L$2:$L$101)+SUMIF(Interface!$I$2:$I$101,\"=\"&Interface!B7,Interface!$M$2:$M$101)+SUMIF(Interface!$J$2:$J$101,\"=\"&Interface!B7,Interface!$M$2:$M$101)+SUMIF(Interface!$K$2:$K$101,\"=\"&Interface!B7,Interface!$M$2:$M$101)","v":957}]
[{"$f":"SUMIF(Interface!$F$2:$F$101,\"=\"&Interface!B8,Interface!$L$2:$L$101)+SUMIF(Interface!$G$2:$G$101,\"=\"&Interface!B8,Interface!$L$2:$L$101)+SUMIF(Interface!$H$2:$H$101,\"=\"&Interface!B8,Interface!$L$2:$L$101)+SUMIF(Interface!$I$2:$I$101,\"=\"&Interface!B8,Interface!$M$2:$M$101)+SUMIF(Interface!$J$2:$J$101,\"=\"&Interface!B8,Interface!$M$2:$M$101)+SUMIF(Interface!$K$2:$K$101,\"=\"&Interface!B8,Interface!$M$2:$M$101)","v":828}]
[{"$f":"SUMIF(Interface!$F$2:$F$101,\"=\"&Interface!B9,Interface!$L$2:$L$101)+SUMIF(Interface!$G$2:$G$101,\"=\"&Interface!B9,Interface!$L$2:$L$101)+SUMIF(Interface!$H$2:$H$101,\"=\"&Interface!B9,Interface!$L$2:$L$101)+SUMIF(Interface!$I$2:$I$101,\"=\"&Interface!B9,Interface!$M$2:$M$101)+SUMIF(Interface!$J$2:$J$101,\"=\"&Interface!B9,Interface!$M$2:$M$101)+SUMIF(Interface!$K$2:$K$101,\"=\"&Interface!B9,Interface!$M$2:$M$101)","v":1003}]
[{"$f":"SUMIF(Interface!$F$2:$F$101,\"=\"&Interface!B10,Interface!$L$2:$L$101)+SUMIF(Interface!$G$2:$G$101,\"=\"&Interface!B10,Interface!$L$2:$L$101)+SUMIF(Interface!$H$2:$H$101,\"=\"&Interface!B10,Interface!$L$2:$L$101)+SUMIF(Interface!$I$2:$I$101,\"=\"&Interface!B10,Interface!$M$2:$M$101)+SUMIF(Interface!$J$2:$J$101,\"=\"&Interface!B10,Interface!$M$2:$M$101)+SUMIF(Interface!$K$2:$K$101,\"=\"&Interface!B10,Interface!$M$2:$M$101)","v":1108}]
[{"$f":"SUMIF(Interface!$F$2:$F$101,\"=\"&Interface!B11,Interface!$L$2:$L$101)+SUMIF(Interface!$G$2:$G$101,\"=\"&Interface!B11,Interface!$L$2:$L$101)+SUMIF(Interface!$H$2:$H$101,\"=\"&Interface!B11,Interface!$L$2:$L$101)+SUMIF(Interface!$I$2:$I$101,\"=\"&Interface!B11,Interface!$M$2:$M$101)+SUMIF(Interface!$J$2:$J$101,\"=\"&Interface!B11,Interface!$M$2:$M$101)+SUMIF(Interface!$K$2:$K$101,\"=\"&Interface!B11,Interface!$M$2:$M$101)","v":861}]
[{"$f":"SUMIF(Interface!$F$2:$F$101,\"=\"&Interface!B12,Interface!$L$2:$L$101)+SUMIF(Interface!$G$2:$G$101,\"=\"&Interface!B12,Interface!$L$2:$L$101)+SUMIF(Interface!$H$2:$H$101,\"=\"&Interface!B12,Interface!$L$2:$L$101)+SUMIF(Interface!$I$2:$I$101,\"=\"&Interface!B12,Interface!$M$2:$M$101)+SUMIF(Interface!$J$2:$J$101,\"=\"&Interface!B12,Interface!$M$2:$M$101)+SUMIF(Interface!$K$2:$K$101,\"=\"&Interface!B12,Interface!$M$2:$M$101)","v":955}]
[{"$f":"SUMIF(Interface!$F$2:$F$101,\"=\"&Interface!B13,Interface!$L$2:$L$101)+SUMIF(Interface!$G$2:$G$101,\"=\"&Interface!B13,Interface!$L$2:$L$101)+SUMIF(Interface!$H$2:$H$101,\"=\"&Interface!B13,Interface!$L$2:$L$101)+SUMIF(Interface!$I$2:$I$101,\"=\"&Interface!B13,Interface!$M$2:$M$101)+SUMIF(Interface!$J$2:$J$101,\"=\"&Interface!B13,Interface!$M$2:$M$101)+SUMIF(Interface!$K$2:$K$101,\"=\"&Interface!B13,Interface!$M$2:$M$101)","v":760}]
[{"$f":"SUMIF(Interface!$F$2:$F$101,\"=\"&Interface!B14,Interface!$L$2:$L$101)+SUMIF(Interface!$G$2:$G$101,\"=\"&Interface!B14,Interface!$L$2:$L$101)+SUMIF(Interface!$H$2:$H$101,\"=\"&Interface!B14,Interface!$L$2:$L$101)+SUMIF(Interface!$I$2:$I$101,\"=\"&Interface!B14,Interface!$M$2:$M$101)+SUMIF(Interface!$J$2:$J$101,\"=\"&Interface!B14,Interface!$M$2:$M$101)+SUMIF(Interface!$K$2:$K$101,\"=\"&Interface!B14,Interface!$M$2:$M$101)","v":679}]
[{"$f":"SUMIF(Interface!$F$2:$F$101,\"=\"&Interface!B15,Interface!$L$2:$L$101)+SUMIF(Interface!$G$2:$G$101,\"=\"&Interface!B15,Interface!$L$2:$L$101)+SUMIF(Interface!$H$2:$H$101,\"=\"&Interface!B15,Interface!$L$2:$L$101)+SUMIF(Interface!$I$2:$I$101,\"=\"&Interface!B15,Interface!$M$2:$M$101)+SUMIF(Interface!$J$2:$J$101,\"=\"&Interface!B15,Interface!$M$2:$M$101)+SUMIF(Interface!$K$2:$K$101,\"=\"&Interface!B15,Interface!$M$2:$M$101)","v":792}]
[{"$f":"SUMIF(Interface!$F$2:$F$101,\"=\"&Interface!B16,Interface!$L$2:$L$101)+SUMIF(Interface!$G$2:$G$101,\"=\"&Interface!B16,Interface!$L$2:$L$101)+SUMIF(Interface!$H$2:$H$101,\"=\"&Interface!B16,Interface!$L$2:$L$101)+SUMIF(Interface!$I$2:$I$101,\"=\"&Interface!B16,Interface!$M$2:$M$101)+SUMIF(Interface!$J$2:$J$101,\"=\"&Interface!B16,Interface!$M$2:$M$101)+SUMIF(Interface!$K$2:$K$101,\"=\"&Interface!B16,Interface!$M$2:$M$101)","v":917}]
[{"$f":"SUMIF(Interface!$F$2:$F$101,\"=\"&Interface!B17,Interface!$L$2:$L$101)+SUMIF(Interface!$G$2:$G$101,\"=\"&Interface!B17,Interface!$L$2:$L$101)+SUMIF(Interface!$H$2:$H$101,\"=\"&Interface!B17,Interface!$L$2:$L$101)+SUMIF(Interface!$I$2:$I$101,\"=\"&Interface!B17,Interface!$M$2:$M$101)+SUMIF(Interface!$J$2:$J$101,\"=\"&Interface!B17,Interface!$M$2:$M$101)+SUMIF(Interface!$K$2:$K$101,\"=\"&Interface!B17,Interface!$M$2:$M$101)","v":967}]
[{"$f":"SUMIF(Interface!$F$2:$F$101,\"=\"&Interface!B18,Interface!$L$2:$L$101)+SUMIF(Interface!$G$2:$G$101,\"=\"&Interface!B18,Interface!$L$2:$L$101)+SUMIF(Interface!$H$2:$H$101,\"=\"&Interface!B18,Interface!$L$2:$L$101)+SUMIF(Interface!$I$2:$I$101,\"=\"&Interface!B18,Interface!$M$2:$M$101)+SUMIF(Interface!$J$2:$J$101,\"=\"&Interface!B18,Interface!$M$2:$M$101)+SUMIF(Interface!$K$2:$K$101,\"=\"&Interface!B18,Interface!$M$2:$M$101)","v":714}]
[{"$f":"SUMIF(Interface!$F$2:$F$101,\"=\"&Interface!B19,Interface!$L$2:$L$101)+SUMIF(Interface!$G$2:$G$101,\"=\"&Interface!B19,Interface!$L$2:$L$101)+SUMIF(Interface!$H$2:$H$101,\"=\"&Interface!B19,Interface!$L$2:$L$101)+SUMIF(Interface!$I$2:$I$101,\"=\"&Interface!B19,Interface!$M$2:$M$101)+SUMIF(Interface!$J$2:$J$101,\"=\"&Interface!B19,Interface!$M$2:$M$101)+SUMIF(Interface!$K$2:$K$101,\"=\"&Interface!B19,Interface!$M$2:$M$101)","v":767}]
[{"$f":"SUMIF(Interface!$F$2:$F$101,\"=\"&Interface!B20,Interface!$L$2:$L$101)+SUMIF(Interface!$G$2:$G$101,\"=\"&Interface!B20,Interface!$L$2:$L$101)+SUMIF(Interface!$H$2:$H$101,\"=\"&Interface!B20,Interface!$L$2:$L$101)+SUMIF(Interface!$I$2:$I$101,\"=\"&Interface!B20,Interface!$M$2:$M$101)+SUMIF(Interface!$J$2:$J$101,\"=\"&Interface!B20,Interface!$M$2:$M$101)+SUMIF(Interface!$K$2:$K$101,\"=\"&Interface!B20,Interface!$M$2:$M$101)","v":985}]
[{"$f":"SUMIF(Interface!$F$2:$F$101,\"=\"&Interface!B21,Interface!$L$2:$L$101)+SUMIF(Interface!$G$2:$G$101,\"=\"&Interface!B21,Interface!$L$2:$L$101)+SUMIF(Interface!$H$2:$H$101,\"=\"&Interface!B21,Interface!$L$2:$L$101)+SUMIF(Interface!$I$2:$I$101,\"=\"&Interface!B21,Interface!$M$2:$M$101)+SUMIF(Interface!$J$2:$J$101,\"=\"&Interface!B21,Interface!$M$2:$M$101)+SUMIF(Interface!$K$2:$K$101,\"=\"&Interface!B21,Interface!$M$2:$M$101)","v":1125}]
{"$rows_left_out":82}
{"sheet":"p","index":5,"n_rows":52,"n_cols":1,"rows_kept":52,"cut":false,"hidden":false,"merged":[]}
[30.4505675239319]
[55.9852224028935]
[32.8113414383411]
[26.4594874701687]
[26.8977996047304]
[47.5414847333653]
[31.4834463518441]
[39.3413228458282]
[54.172444502544]
[16.0490412215651]
[49.4849922996644]
[22.3509637015514]
[13.9439482508267]
[21.087984709219]
[31.9789169495298]
[46.093850346384]
[16.6351799802611]
[14.7509693630887]
[49.5476243032061]
[57.2018493105972]
{"$rows_left_out":33}
{"sheet":"Results","index":6,"n_rows":52,"n_cols":2,"rows_kept":52,"cut":false,"hidden":false,"merged":[]}
[30.4505675239319,101]
[55.9852224028935,111]
[32.8113414383411,171]
[26.4594874701687,291]
[26.8977996047304,375]
[47.5414847333653,379]
[31.4834463518441,931]
[39.3413228458282,1625]
[54.172444502544,1736]
[16.0490412215651,1739]
[49.4849922996644,1756]
[22.3509637015514,1781]
[13.9439482508267,1850]
[21.087984709219,2022]
[31.9789169495298,2039]
[46.093850346384,2062]
[16.6351799802611,2136]
[14.7509693630887,2151]
[49.5476243032061,2338]
[57.2018493105972,2451]
{"$rows_left_out":33}
{"sheet":"Analysis","index":7,"n_rows":11,"n_cols":7,"rows_kept":11,"cut":false,"hidden":false,"merged":[]}
[null,"top 10 OPRs","team","z-score",null,"Average OPR:",{"$f":"AVERAGE(Results!$A$1:$A$100)","v":27.3777181475296}]
[1,{"$f":"LARGE(Results!$A$1:$A$100,ROW(A1))","v":57.2018493105972},{"$f":"VLOOKUP(B2,Results!$A$1:$B$100,2,FALSE)","v":2451},{"$f":"STANDARDIZE(B2,G$1,G$2)","v":2.22658902326186},null,"StDev:",{"$f":"_xlfn.STDEV.P(Results!A1:A100)","v":13.3945379463771}]
[2,{"$f":"LARGE(Results!$A$1:$A$100,ROW(A2))","v":55.9852224028935},{"$f":"VLOOKUP(B3,Results!$A$1:$B$100,2,FALSE)","v":111},{"$f":"STANDARDIZE(B3,G$1,G$2)","v":2.13575894666091}]
[3,{"$f":"LARGE(Results!$A$1:$A$100,ROW(A3))","v":54.172444502544},{"$f":"VLOOKUP(B4,Results!$A$1:$B$100,2,FALSE)","v":1736},{"$f":"STANDARDIZE(B4,G$1,G$2)","v":2.00042184824014}]
[4,{"$f":"LARGE(Results!$A$1:$A$100,ROW(A4))","v":49.5476243032061},{"$f":"VLOOKUP(B5,Results!$A$1:$B$100,2,FALSE)","v":2338},{"$f":"STANDARDIZE(B5,G$1,G$2)","v":1.65514527223188}]
[5,{"$f":"LARGE(Results!$A$1:$A$100,ROW(A5))","v":49.4849922996644},{"$f":"VLOOKUP(B6,Results!$A$1:$B$100,2,FALSE)","v":1756},{"$f":"STANDARDIZE(B6,G$1,G$2)","v":1.65046933613073}]
[6,{"$f":"LARGE(Results!$A$1:$A$100,ROW(A6))","v":47.5414847333653},{"$f":"VLOOKUP(B7,Results!$A$1:$B$100,2,FALSE)","v":379},{"$f":"STANDARDIZE(B7,G$1,G$2)","v":1.50537231418942}]
[7,{"$f":"LARGE(Results!$A$1:$A$100,ROW(A7))","v":46.1464390455273},{"$f":"VLOOKUP(B8,Results!$A$1:$B$100,2,FALSE)","v":4143},{"$f":"STANDARDIZE(B8,G$1,G$2)","v":1.40122197369818}]
[8,{"$f":"LARGE(Results!$A$1:$A$100,ROW(A8))","v":46.093850346384},{"$f":"VLOOKUP(B9,Results!$A$1:$B$100,2,FALSE)","v":2062},{"$f":"STANDARDIZE(B9,G$1,G$2)","v":1.39729584355814}]
[9,{"$f":"LARGE(Results!$A$1:$A$100,ROW(A9))","v":40.3591049633887},{"$f":"VLOOKUP(B10,Results!$A$1:$B$100,2,FALSE)","v":4241},{"$f":"STANDARDIZE(B10,G$1,G$2)","v":0.969155253270259}]
[10,{"$f":"LARGE(Results!$A$1:$A$100,ROW(A10))","v":39.3413228458282},{"$f":"VLOOKUP(B11,Results!$A$1:$B$100,2,FALSE)","v":1625},{"$f":"STANDARDIZE(B11,G$1,G$2)","v":0.893170391258962}]